RDF Description of Bass guitar
type: DataItem
type: Document
date: 2025-11-03T12:12:02.242Z
contained by: dataset
in dataset: dataset
primary topic: Bass guitar

Bass guitar
type: Class
comment: Bass (modern, typically electrical, but not always)
subclass of: http://dbtune.org/musicbrainz/resource/instrument/75