Bass guitar
type: Class
comment: Bass (modern, typically electrical, but not always)
subclass of: http://dbtune.org/musicbrainz/resource/instrument/75

RDF Description of Bass guitar
type: Document
contained by: dataset
in dataset: dataset
date: 2025-11-03T12:12:02.874Z
type: DataItem
primary topic: Bass guitar